Reaction Details
TargetALK tyrosine kinase receptor
LigandBDBM50025728
Substrate/Competitorn/a
Meas. Tech.ChEMBL_1436034 (CHEMBL3383505)
IC50>1000±n/a nM
Citation Liu, ZYue, XSong, ZPeng, XGuo, JJi, YCheng, ZDing, JAi, JGeng, MZhang, A Design, synthesis and pharmacological evaluation of 2-(thiazol-2-amino)-4-arylaminopyrimidines as potent anaplastic lymphoma kinase (ALK) inhibitors. Eur J Med Chem86:438-48 (2014) 
 
ALK tyrosine kinase receptor
Name:ALK tyrosine kinase receptor
Type:Protein
Mol. Mass.:176453.10
Organism:Homo sapiens (Human)
Description:Q9UM73
Residue:1620
BDBM50025728
NameBDBM50025728
Synonyms:CHEMBL3330873
TypeSmall organic molecule
Emp. Form.C21H23ClN6O4S2
Mol. Mass.523.028
SMILESCC(C)S(=O)(=O)c1ccccc1Nc1nc(Nc2nc(cs2)C(=O)N2CCOCC2)ncc1Cl