Reaction Details
TargetALK tyrosine kinase receptor
LigandBDBM50025732
Substrate/Competitorn/a
Meas. Tech.ChEMBL_1436034 (CHEMBL3383505)
IC50>1000±n/a nM
Citation Liu, ZYue, XSong, ZPeng, XGuo, JJi, YCheng, ZDing, JAi, JGeng, MZhang, A Design, synthesis and pharmacological evaluation of 2-(thiazol-2-amino)-4-arylaminopyrimidines as potent anaplastic lymphoma kinase (ALK) inhibitors. Eur J Med Chem86:438-48 (2014) 
 
ALK tyrosine kinase receptor
Name:ALK tyrosine kinase receptor
Type:Protein
Mol. Mass.:176453.10
Organism:Homo sapiens (Human)
Description:Q9UM73
Residue:1620
BDBM50025732
NameBDBM50025732
Synonyms:CHEMBL3330872
TypeSmall organic molecule
Emp. Form.C22H25ClN6O3S2
Mol. Mass.521.055
SMILESCC(C)S(=O)(=O)c1ccccc1Nc1nc(Nc2nc(cs2)C(=O)N2CCCCC2)ncc1Cl