Reaction Details
TargetALK tyrosine kinase receptor
LigandBDBM50025746
Substrate/Competitorn/a
Meas. Tech.ChEMBL_1436034 (CHEMBL3383505)
IC50>1000±n/a nM
Citation Liu, ZYue, XSong, ZPeng, XGuo, JJi, YCheng, ZDing, JAi, JGeng, MZhang, A Design, synthesis and pharmacological evaluation of 2-(thiazol-2-amino)-4-arylaminopyrimidines as potent anaplastic lymphoma kinase (ALK) inhibitors. Eur J Med Chem86:438-48 (2014) 
 
ALK tyrosine kinase receptor
Name:ALK tyrosine kinase receptor
Type:Protein
Mol. Mass.:176453.10
Organism:Homo sapiens (Human)
Description:Q9UM73
Residue:1620
BDBM50025746
NameBDBM50025746
Synonyms:CHEMBL3330870
TypeSmall organic molecule
Emp. Form.C26H27ClN6O6S2
Mol. Mass.619.112
SMILESCOc1cc(NC(=O)c2csc(Nc3ncc(Cl)c(Nc4ccccc4S(=O)(=O)C(C)C)n3)n2)cc(OC)c1OC