Reaction Details
TargetALK tyrosine kinase receptor
LigandBDBM50025750
Substrate/Competitorn/a
Meas. Tech.ChEMBL_1436034 (CHEMBL3383505)
IC50>1000±n/a nM
Citation Liu, ZYue, XSong, ZPeng, XGuo, JJi, YCheng, ZDing, JAi, JGeng, MZhang, A Design, synthesis and pharmacological evaluation of 2-(thiazol-2-amino)-4-arylaminopyrimidines as potent anaplastic lymphoma kinase (ALK) inhibitors. Eur J Med Chem86:438-48 (2014) 
 
ALK tyrosine kinase receptor
Name:ALK tyrosine kinase receptor
Type:Protein
Mol. Mass.:176453.10
Organism:Homo sapiens (Human)
Description:Q9UM73
Residue:1620
BDBM50025750
NameBDBM50025750
Synonyms:CHEMBL3330867
TypeSmall organic molecule
Emp. Form.C21H24ClN5O4S2
Mol. Mass.510.029
SMILESCCCCOC(=O)c1csc(Nc2ncc(Cl)c(Nc3ccccc3S(=O)(=O)C(C)C)n2)n1