Reaction Details
TargetALK tyrosine kinase receptor
LigandBDBM50025755
Substrate/Competitorn/a
Meas. Tech.ChEMBL_1436034 (CHEMBL3383505)
IC50 775±n/a nM
Citation Liu, ZYue, XSong, ZPeng, XGuo, JJi, YCheng, ZDing, JAi, JGeng, MZhang, A Design, synthesis and pharmacological evaluation of 2-(thiazol-2-amino)-4-arylaminopyrimidines as potent anaplastic lymphoma kinase (ALK) inhibitors. Eur J Med Chem86:438-48 (2014) 
 
ALK tyrosine kinase receptor
Name:ALK tyrosine kinase receptor
Type:Protein
Mol. Mass.:176453.10
Organism:Homo sapiens (Human)
Description:Q9UM73
Residue:1620
BDBM50025755
NameBDBM50025755
Synonyms:CHEMBL3330863
TypeSmall organic molecule
Emp. Form.C25H30ClN7O4S2
Mol. Mass.592.133
SMILESCC(C)S(=O)(=O)c1ccccc1Nc1nc(Nc2nc3CCN(CC(=O)N4CCOCC4)Cc3s2)ncc1Cl