Reaction Details
TargetBromodomain-containing protein 3
LigandBDBM50028126
Substrate/Competitorn/a
Meas. Tech.ChEMBL_1434713 (CHEMBL3382828)
IC50 398±n/a nM
Citation Gosmini, RNguyen, VLToum, JSimon, CBrusq, JMKrysa, GMirguet, ORiou-Eymard, AMBoursier, EVTrottet, LBamborough, PClark, HChung, CWCutler, LDemont, EHKaur, RLewis, AJSchilling, MBSoden, PETaylor, SWalker, ALWalker, MDPrinjha, RKNicodème, E The discovery of I-BET726 (GSK1324726A), a potent tetrahydroquinoline ApoA1 up-regulator and selective BET bromodomain inhibitor. J Med Chem57:8111-31 (2014) 
 
Bromodomain-containing protein 3
Name:Bromodomain-containing protein 3
Type:Protein
Mol. Mass.:79571.81
Organism:Homo sapiens (Human)
Description:Q15059
Residue:726
BDBM50028126
NameBDBM50028126
Synonyms:CHEMBL3353991
TypeSmall organic molecule
Emp. Form.C30H35N3O
Mol. Mass.453.6184
SMILESC[C@H]1C[C@@H](Nc2ccccc2)c2cc(ccc2N1C(C)=O)-c1cccc(CN2CCCCC2)c1