Reaction Details
TargetBromodomain-containing protein 3
LigandBDBM50028140
Substrate/Competitorn/a
Meas. Tech.ChEMBL_1434713 (CHEMBL3382828)
IC50 501±n/a nM
Citation Gosmini, RNguyen, VLToum, JSimon, CBrusq, JMKrysa, GMirguet, ORiou-Eymard, AMBoursier, EVTrottet, LBamborough, PClark, HChung, CWCutler, LDemont, EHKaur, RLewis, AJSchilling, MBSoden, PETaylor, SWalker, ALWalker, MDPrinjha, RKNicodème, E The discovery of I-BET726 (GSK1324726A), a potent tetrahydroquinoline ApoA1 up-regulator and selective BET bromodomain inhibitor. J Med Chem57:8111-31 (2014) 
 
Bromodomain-containing protein 3
Name:Bromodomain-containing protein 3
Type:Protein
Mol. Mass.:79571.81
Organism:Homo sapiens (Human)
Description:Q15059
Residue:726
BDBM50028140
NameBDBM50028140
Synonyms:CHEMBL3353998
TypeSmall organic molecule
Emp. Form.C27H28N2O5S
Mol. Mass.492.587
SMILESCOC(=O)c1ccc(cc1)-c1ccc2N([C@@H](C)C[C@@H](Nc3ccc(cc3)S(C)(=O)=O)c2c1)C(C)=O