Reaction Details
TargetBromodomain-containing protein 4
LigandBDBM50028105
Substrate/Competitorn/a
Meas. Tech.ChEMBL_1434714 (CHEMBL3382829)
IC50 1259±n/a nM
Citation Gosmini, RNguyen, VLToum, JSimon, CBrusq, JMKrysa, GMirguet, ORiou-Eymard, AMBoursier, EVTrottet, LBamborough, PClark, HChung, CWCutler, LDemont, EHKaur, RLewis, AJSchilling, MBSoden, PETaylor, SWalker, ALWalker, MDPrinjha, RKNicodème, E The discovery of I-BET726 (GSK1324726A), a potent tetrahydroquinoline ApoA1 up-regulator and selective BET bromodomain inhibitor. J Med Chem57:8111-31 (2014) 
 
Bromodomain-containing protein 4
Name:Bromodomain-containing protein 4
Type:Protein
Mol. Mass.:152264.84
Organism:Homo sapiens (Human)
Description:O60885
Residue:1362
BDBM50028105
NameBDBM50028105
Synonyms:CHEMBL3353986
TypeSmall organic molecule
Emp. Form.C26H26N2O3
Mol. Mass.414.4962
SMILESCOC(=O)c1ccc(cc1)-c1ccc2N([C@@H](C)C[C@@H](Nc3ccccc3)c2c1)C(C)=O