Reaction Details
TargetBromodomain adjacent to zinc finger domain protein 2A
LigandBDBM50028142
Substrate/Competitorn/a
Meas. Tech.ChEMBL_1434736 (CHEMBL3383405)
IC50<31623±n/a nM
Citation Gosmini, RNguyen, VLToum, JSimon, CBrusq, JMKrysa, GMirguet, ORiou-Eymard, AMBoursier, EVTrottet, LBamborough, PClark, HChung, CWCutler, LDemont, EHKaur, RLewis, AJSchilling, MBSoden, PETaylor, SWalker, ALWalker, MDPrinjha, RKNicodème, E The discovery of I-BET726 (GSK1324726A), a potent tetrahydroquinoline ApoA1 up-regulator and selective BET bromodomain inhibitor. J Med Chem57:8111-31 (2014) 
 
Bromodomain adjacent to zinc finger domain protein 2A
Name:Bromodomain adjacent to zinc finger domain protein 2A
Type:PROTEIN
Mol. Mass.:211197.21
Organism:Homo sapiens (Human)
Description:ChEMBL_108002
Residue:1905
BDBM50028142
NameBDBM50028142
Synonyms:CHEMBL2177300
TypeSmall organic molecule
Emp. Form.C25H23ClN2O3
Mol. Mass.434.915
SMILESC[C@H]1C[C@@H](Nc2ccc(Cl)cc2)c2cc(ccc2N1C(C)=O)-c1ccc(cc1)C(O)=O