Reaction Details
TargetCytochrome P450 3A4
LigandBDBM50028128
Substrate/Competitorn/a
Meas. Tech.ChEMBL_1434728 (CHEMBL3382843)
IC50 2000±n/a nM
Citation Gosmini, RNguyen, VLToum, JSimon, CBrusq, JMKrysa, GMirguet, ORiou-Eymard, AMBoursier, EVTrottet, LBamborough, PClark, HChung, CWCutler, LDemont, EHKaur, RLewis, AJSchilling, MBSoden, PETaylor, SWalker, ALWalker, MDPrinjha, RKNicodème, E The discovery of I-BET726 (GSK1324726A), a potent tetrahydroquinoline ApoA1 up-regulator and selective BET bromodomain inhibitor. J Med Chem57:8111-31 (2014) 
 
Cytochrome P450 3A4
Name:Cytochrome P450 3A4
Type:Enzyme
Mol. Mass.:57349.57
Organism:Homo sapiens (Human)
Description:n/a
Residue:503
BDBM50028128
NameBDBM50028128
Synonyms:CHEMBL3353992
TypeSmall organic molecule
Emp. Form.C30H35N3O
Mol. Mass.453.6184
SMILESC[C@H]1C[C@@H](Nc2ccccc2)c2cc(ccc2N1C(C)=O)-c1ccc(CN2CCCCC2)cc1