Reaction Details
TargetAcetylcholinesterase
LigandBDBM8961
Substrate/Competitorn/a
Meas. Tech.ChEMBL_1439857 (CHEMBL3387411)
IC50 500±n/a nM
Citation Nepovimova, EUliassi, EKorabecny, JPeña-Altamira, LESamez, SPesaresi, AGarcia, GEBartolini, MAndrisano, VBergamini, CFato, RLamba, DRoberti, MKuca, KMonti, BBolognesi, ML Multitarget drug design strategy: quinone-tacrine hybrids designed to block amyloid-ß aggregation and to exert anticholinesterase and antioxidant effects. J Med Chem57:8576-89 (2014) 
 
Acetylcholinesterase
Name:Acetylcholinesterase
Type:Enzyme
Mol. Mass.:67792.70
Organism:Homo sapiens (Human)
Description:P22303
Residue:614
BDBM8961
NameBDBM8961
Synonyms:1,2,3,4-tetrahydro-9-acridinamine 9-THA CHEMBL1337960 Cognex Tracine cid_1935 | tacrine.HCl
TypeSmall organic molecule
Emp. Form.C13H14N2
Mol. Mass.198.2637
SMILESNc1c2CCCCc2nc2ccccc12