Reaction Details
TargetEpidermal growth factor receptor
LigandBDBM50029668
Substrate/Competitorn/a
Meas. Tech.ChEMBL_1436962 (CHEMBL3389021)
IC50 17000±n/a nM
Citation Finlay, MRAnderton, MAshton, SBallard, PBethel, PABox, MRBradbury, RHBrown, SJButterworth, SCampbell, AChorley, CColclough, NCross, DACurrie, GSGrist, MHassall, LHill, GBJames, DJames, MKemmitt, PKlinowska, TLamont, GLamont, SGMartin, NMcFarland, HLMellor, MJOrme, JPPerkins, DPerkins, PRichmond, GSmith, PWard, RAWaring, MJWhittaker, DWells, SWrigley, GL Discovery of a potent and selective EGFR inhibitor (AZD9291) of both sensitizing and T790M resistance mutations that spares the wild type form of the receptor. J Med Chem57:8249-67 (2014) 
 
Epidermal growth factor receptor
Name:Epidermal growth factor receptor
Synonyms:Epidermal growth factor receptor/Receptor tyrosine-protein kinase erbB-2/Receptor tyrosine-protein kinase erbB-3/Receptor tyrosine-protein kinase erbB-4
Type:n/a
Mol. Mass.:n/a
Description:ASSAY_ID of ChEMBL is 2209351
Components:This complex has 4 components.
Component 1
Name:Receptor tyrosine-protein kinase erbB-2
Type:n/a
Mol. Mass.:137894.47
Organism:Homo sapiens (Human)
Description:P04626
Residue:1255
Component 2
Name:Epidermal growth factor receptor
Synonyms:EGF Receptor Substrate EGFR_HUMAN ERBB1 Epidermal Growth Factor Receptor erbB-1 Epidermal growth factor receptor (EGFR) HER1 Proto-oncogene c-ErbB-1 Tyrosine-Protein Kinase ErbB-1
Type:Receptor Kinase Domain
Mol. Mass.:134279.59
Organism:Homo sapiens (Human)
Description:P00533
Residue:1210
Component 3
Name:Receptor tyrosine-protein kinase erbB-4
Synonyms:ERBB4 Epidermal growth factor receptor ErbB-4 (HER4) Tyrosine Kinase Proto-oncogene c-ErbB-4 Receptor protein-tyrosine kinase erbB-4 Tyrosine kinase-type cell surface receptor HER4 (HER4)
Type:Protein
Mol. Mass.:146803.56
Organism:Homo sapiens (Human)
Description:Q15303
Residue:1308
Component 4
Name:Receptor tyrosine-protein kinase erbB-3
Synonyms:ERBB3 HER3 Tyrosine kinase-type cell surface receptor HER3
Type:PROTEIN
Mol. Mass.:148097.73
Organism:Homo sapiens (Human)
Description:ChEMBL_774331
Residue:1342
BDBM50029668
NameBDBM50029668
Synonyms:AZD-9291 US10085983, Compound AZD-9291 US11111233, Example AZD9291 US20230322822, Compound AZD9291 WO2022090481, Example osimertinib
TypeSmall organic molecule
Emp. Form.C28H33N7O2
Mol. Mass.499.6073
SMILESCOc1cc(N(C)CCN(C)C)c(NC(=O)C=C)cc1Nc1nccc(n1)-c1cn(C)c2ccccc12