Reaction Details
TargetInsulin-like growth factor 1 receptor
LigandBDBM50029685
Substrate/Competitorn/a
Meas. Tech.ChEMBL_1436970 (CHEMBL3389029)
IC50 6.0±n/a nM
Citation Finlay, MRAnderton, MAshton, SBallard, PBethel, PABox, MRBradbury, RHBrown, SJButterworth, SCampbell, AChorley, CColclough, NCross, DACurrie, GSGrist, MHassall, LHill, GBJames, DJames, MKemmitt, PKlinowska, TLamont, GLamont, SGMartin, NMcFarland, HLMellor, MJOrme, JPPerkins, DPerkins, PRichmond, GSmith, PWard, RAWaring, MJWhittaker, DWells, SWrigley, GL Discovery of a potent and selective EGFR inhibitor (AZD9291) of both sensitizing and T790M resistance mutations that spares the wild type form of the receptor. J Med Chem57:8249-67 (2014) 
 
Insulin-like growth factor 1 receptor
Name:Insulin-like growth factor 1 receptor
Type:Protein
Mol. Mass.:154776.79
Organism:Homo sapiens (Human)
Description:P08069
Residue:1367
BDBM50029685
NameBDBM50029685
Synonyms:CHEMBL3353404 | US10227342, Example 52
TypeSmall organic molecule
Emp. Form.C26H29ClN8O2
Mol. Mass.521.014
SMILESCOc1cc(N(C)CCN(C)C)c(NC(=O)C=C)cc1Nc1ncc(Cl)c(n1)-c1cnn2ccccc12