Reaction Details
TargetPeptidyl-prolyl cis-trans isomerase F, mitochondrial
LigandBDBM50339127
Substrate/Competitorn/a
Meas. Tech.ChEMBL_1436364 (CHEMBL3389567)
Kd 1.000000±n/a nM
Citation Fu, JTjandra, MBecker, CBednarczyk, DCapparelli, MElling, RHanna, IFujimoto, RFuregati, MKarur, SKasprzyk, TKnapp, MLeung, KLi, XLu, PMergo, WMiault, CNg, SParker, DPeng, YRoggo, SRivkin, ASimmons, RLWang, MWiedmann, BWeiss, AHXiao, LXie, LXu, WYifru, AYang, SZhou, BSweeney, ZK Potent nonimmunosuppressive cyclophilin inhibitors with improved pharmaceutical properties and decreased transporter inhibition. J Med Chem57:8503-16 (2014) 
 
Peptidyl-prolyl cis-trans isomerase F, mitochondrial
Name:Peptidyl-prolyl cis-trans isomerase F, mitochondrial
Type:PROTEIN
Mol. Mass.:22052.60
Organism:Homo sapiens (Human)
Description:ChEMBL_109465
Residue:207
BDBM50339127
NameBDBM50339127
Synonyms:(3S,6S,9S,12R,15S,18S,21S,24S,27R,30S,33S)-25,30-diethyl-33-((1R,2R)-1-hydroxy-2-methylhex-4-enyl)-6,9,18-triisobutyl-3,21,24-triisopropyl-1,4,7,10,12,15,19,27,28-nonamethyl-1,4,7,10,13,16,19,22,25,28,31-undecaazacyclotritriacontan-2,5,8,11,14,17,20,23,26,29,32-undecaone CHEMBL1651956
TypeSmall organic molecule
Emp. Form.C63H113N11O12
Mol. Mass.1216.6378
SMILESCC[C@@H]1NC(=O)[C@H]([C@H](O)[C@H](C)C\C=C\C)N(C)C(=O)[C@H](C(C)C)N(C)C(=O)[C@H](CC(C)C)N(C)C(=O)[C@H](CC(C)C)N(C)C(=O)[C@@H](C)NC(=O)[C@H](C)NC(=O)[C@H](CC(C)C)N(C)C(=O)[C@@H](NC(=O)[C@H](C(C)C)N(CC)C(=O)[C@@H](C)N(C)C1=O)C(C)C