Reaction Details
TargetPeptidyl-prolyl cis-trans isomerase A
LigandBDBM50030494
Substrate/Competitorn/a
Meas. Tech.ChEMBL_1436352 (CHEMBL3388994)
Kd 1.1±n/a nM
Citation Fu, JTjandra, MBecker, CBednarczyk, DCapparelli, MElling, RHanna, IFujimoto, RFuregati, MKarur, SKasprzyk, TKnapp, MLeung, KLi, XLu, PMergo, WMiault, CNg, SParker, DPeng, YRoggo, SRivkin, ASimmons, RLWang, MWiedmann, BWeiss, AHXiao, LXie, LXu, WYifru, AYang, SZhou, BSweeney, ZK Potent nonimmunosuppressive cyclophilin inhibitors with improved pharmaceutical properties and decreased transporter inhibition. J Med Chem57:8503-16 (2014) 
 
Peptidyl-prolyl cis-trans isomerase A
Name:Peptidyl-prolyl cis-trans isomerase A
Type:Protein
Mol. Mass.:18015.32
Organism:Homo sapiens (Human)
Description:P62937
Residue:165
BDBM50030494
NameBDBM50030494
Synonyms:CHEMBL3344503
TypeSmall organic molecule
Emp. Form.C68H122N12O14
Mol. Mass.1331.7683
SMILES[H][C@@]1([C@H](C)COCCN2CCOCC2)N(C)C(=O)[C@@H](C)N(C)C(=O)[C@H](CC)NC(=O)[C@]([H])([C@H](O)[C@H](C)C\C=C\C)N(C)C(=O)[C@H](C(C)C)N(C)C(=O)[C@H](CC(C)C)N(C)C(=O)[C@H](CC(C)C)N(C)C(=O)[C@@H](C)NC(=O)[C@H](C)NC(=O)[C@H](CC(C)C)N(C)C(=O)[C@@H](NC1=O)C(C)C