Reaction Details
TargetSolute carrier organic anion transporter family member 1B1
LigandBDBM50030538
Substrate/Competitorn/a
Meas. Tech.ChEMBL_1436354 (CHEMBL3388996)
IC50 1400±n/a nM
Citation Fu, JTjandra, MBecker, CBednarczyk, DCapparelli, MElling, RHanna, IFujimoto, RFuregati, MKarur, SKasprzyk, TKnapp, MLeung, KLi, XLu, PMergo, WMiault, CNg, SParker, DPeng, YRoggo, SRivkin, ASimmons, RLWang, MWiedmann, BWeiss, AHXiao, LXie, LXu, WYifru, AYang, SZhou, BSweeney, ZK Potent nonimmunosuppressive cyclophilin inhibitors with improved pharmaceutical properties and decreased transporter inhibition. J Med Chem57:8503-16 (2014) 
 
Solute carrier organic anion transporter family member 1B1
Name:Solute carrier organic anion transporter family member 1B1
Type:Protein
Mol. Mass.:76468.06
Organism:Homo sapiens (Human)
Description:Q9Y6L6
Residue:691
BDBM50030538
NameBDBM50030538
Synonyms:CHEMBL3344497 | US9566312, Compound 2.5.18
TypeSmall organic molecule
Emp. Form.C66H116F2N12O12
Mol. Mass.1307.6972
SMILES[H][C@@]1([C@H](C)CN2CCC(F)(F)C2)N(C)C(=O)[C@@H](C)N(C)C(=O)[C@H](CC)NC(=O)[C@]([H])([C@H](O)[C@H](C)C\C=C\C)N(C)C(=O)[C@H](C(C)C)N(C)C(=O)[C@H](CC(C)C)N(C)C(=O)[C@H](CC(C)C)N(C)C(=O)[C@@H](C)NC(=O)[C@H](C)NC(=O)[C@H](CC(C)C)N(C)C(=O)[C@@H](NC1=O)C(C)C