Reaction Details
TargetG-protein coupled receptor 39
LigandBDBM50030769
Substrate/Competitorn/a
Meas. Tech.ChEMBL_1438504 (CHEMBL3385494)
EC50 10000±n/a nM
Citation Peukert, SHughes, RNunez, JHe, GYan, ZJain, RLlamas, LLuchansky, SCarlson, ALiang, GKunjathoor, VPietropaolo, MShapiro, JCastellana, AWu, XBose, A Discovery of 2-Pyridylpyrimidines as the First Orally Bioavailable GPR39 Agonists. ACS Med Chem Lett5:1114-8 (2014) 
 
G-protein coupled receptor 39
Name:G-protein coupled receptor 39
Type:PROTEIN
Mol. Mass.:51615.79
Organism:Mus musculus
Description:ChEMBL_109498
Residue:456
BDBM50030769
NameBDBM50030769
Synonyms:CHEMBL3342363
TypeSmall organic molecule
Emp. Form.C13H14N4
Mol. Mass.226.2771
SMILESC(Nc1cc(ncn1)-c1ccccn1)C1CC1