Reaction Details
TargetRCG37580
LigandBDBM50030776
Substrate/Competitorn/a
Meas. Tech.ChEMBL_1438505 (CHEMBL3385495)
EC50 2.0±n/a nM
Citation Peukert, SHughes, RNunez, JHe, GYan, ZJain, RLlamas, LLuchansky, SCarlson, ALiang, GKunjathoor, VPietropaolo, MShapiro, JCastellana, AWu, XBose, A Discovery of 2-Pyridylpyrimidines as the First Orally Bioavailable GPR39 Agonists. ACS Med Chem Lett5:1114-8 (2014) 
 
RCG37580
Name:RCG37580
Type:PROTEIN
Mol. Mass.:33217.74
Organism:Rattus norvegicus
Description:ChEMBL_107978
Residue:298
BDBM50030776
NameBDBM50030776
Synonyms:CHEMBL3342377
TypeSmall organic molecule
Emp. Form.C19H20N6O
Mol. Mass.348.4017
SMILESCNc1nc(NCc2ccc(NC(C)=O)cc2)cc(n1)-c1ccccn1