Reaction Details
TargetNeurotensin receptor type 1
LigandBDBM50030788
Substrate/Competitorn/a
Meas. Tech.ChEMBL_1438517 (CHEMBL3385507)
IC50>30000±n/a nM
Citation Peukert, SHughes, RNunez, JHe, GYan, ZJain, RLlamas, LLuchansky, SCarlson, ALiang, GKunjathoor, VPietropaolo, MShapiro, JCastellana, AWu, XBose, A Discovery of 2-Pyridylpyrimidines as the First Orally Bioavailable GPR39 Agonists. ACS Med Chem Lett5:1114-8 (2014) 
 
Neurotensin receptor type 1
Name:Neurotensin receptor type 1
Type:PROTEIN
Mol. Mass.:46278.89
Organism:Homo sapiens (Human)
Description:ChEMBL_1453811
Residue:418
BDBM50030788
NameBDBM50030788
Synonyms:CHEMBL3342358
TypeSmall organic molecule
Emp. Form.C18H19ClN6O2S
Mol. Mass.418.9
SMILESCNc1nc(NCc2ccc(NS(C)(=O)=O)cc2Cl)cc(n1)-c1ccccn1