Reaction Details
TargetPotassium voltage-gated channel subfamily H member 2
LigandBDBM50031618
Substrate/Competitorn/a
Meas. Tech.ChEMBL_1441679 (CHEMBL3377656)
Ki>10000±n/a nM
Citation Dineen, TAChen, KCheng, ACDerakhchan, KEpstein, OEsmay, JHickman, DKreiman, CEMarx, IEWahl, RCWen, PHWeiss, MMWhittington, DAWood, SFremeau, RTWhite, RDPatel, VF Inhibitors of฿-site amyloid precursor protein cleaving enzyme (BACE1): identification of (S)-7-(2-fluoropyridin-3-yl)-3-((3-methyloxetan-3-yl)ethynyl)-5'H-spiro[chromeno[2,3-b]pyridine-5,4'-oxazol]-2'-amine (AMG-8718). J Med Chem57:9811-31 (2014) 
 
Potassium voltage-gated channel subfamily H member 2
Name:Potassium voltage-gated channel subfamily H member 2
Type:Multi-pass membrane protein
Mol. Mass.:126672.65
Organism:Homo sapiens (Human)
Description:Q12809
Residue:1159
BDBM50031618
NameBDBM50031618
Synonyms:CHEMBL3359759
TypeSmall organic molecule
Emp. Form.C24H15F2N5O2
Mol. Mass.443.405
SMILESNC1=N[C@@]2(CO1)c1cc(ccc1Oc1ncc(cc21)-c1ccnc(F)c1)-c1cccnc1F