Reaction Details
TargetBeta-secretase 1
LigandBDBM50031615
Substrate/Competitorn/a
Meas. Tech.ChEMBL_1441677 (CHEMBL3377654)
IC50 1.2±n/a nM
Citation Dineen, TAChen, KCheng, ACDerakhchan, KEpstein, OEsmay, JHickman, DKreiman, CEMarx, IEWahl, RCWen, PHWeiss, MMWhittington, DAWood, SFremeau, RTWhite, RDPatel, VF Inhibitors of฿-site amyloid precursor protein cleaving enzyme (BACE1): identification of (S)-7-(2-fluoropyridin-3-yl)-3-((3-methyloxetan-3-yl)ethynyl)-5'H-spiro[chromeno[2,3-b]pyridine-5,4'-oxazol]-2'-amine (AMG-8718). J Med Chem57:9811-31 (2014) 
 
Beta-secretase 1
Name:Beta-secretase 1
Type:Protein
Mol. Mass.:55755.10
Organism:Homo sapiens (Human)
Description:P56817
Residue:501
BDBM50031615
NameBDBM50031615
Synonyms:CHEMBL3359762
TypeSmall organic molecule
Emp. Form.C24H19FN4O3
Mol. Mass.430.4311
SMILESCC(C)(O)C#Cc1cnc2Oc3ccc(cc3[C@@]3(COC(N)=N3)c2c1)-c1cccnc1F