Reaction Details
TargetHepatocyte growth factor receptor
LigandBDBM50035391
Substrate/Competitorn/a
Meas. Tech.ChEMBL_1432749 (CHEMBL3381417)
IC50 15±n/a nM
Citation Zhou, SLiao, HLiu, MFeng, GFu, BLi, RCheng, MZhao, YGong, P Discovery andw biological evaluation of novel 6,7-disubstituted-4-(2-fluorophenoxy)quinoline derivatives possessing 1,2,3-triazole-4-carboxamide moiety as c-Met kinase inhibitors. Bioorg Med Chem22:6438-52 (2014) 
 
Hepatocyte growth factor receptor
Name:Hepatocyte growth factor receptor
Type:Protein
Mol. Mass.:155559.73
Organism:Homo sapiens (Human)
Description:P08581
Residue:1390
BDBM50035391
NameBDBM50035391
Synonyms:CHEMBL3343370
TypeSmall organic molecule
Emp. Form.C34H32F4N6O5
Mol. Mass.680.6487
SMILESCOc1ccc(cc1)-n1nnc(C(=O)Nc2ccc(Oc3ccnc4cc(OCCCN5CCCC5)c(OC)cc34)c(F)c2)c1C(F)(F)F