Reaction Details
TargetHepatocyte growth factor receptor
LigandBDBM50035402
Substrate/Competitorn/a
Meas. Tech.ChEMBL_1432749 (CHEMBL3381417)
IC50 13±n/a nM
Citation Zhou, SLiao, HLiu, MFeng, GFu, BLi, RCheng, MZhao, YGong, P Discovery andw biological evaluation of novel 6,7-disubstituted-4-(2-fluorophenoxy)quinoline derivatives possessing 1,2,3-triazole-4-carboxamide moiety as c-Met kinase inhibitors. Bioorg Med Chem22:6438-52 (2014) 
 
Hepatocyte growth factor receptor
Name:Hepatocyte growth factor receptor
Type:Protein
Mol. Mass.:155559.73
Organism:Homo sapiens (Human)
Description:P08581
Residue:1390
BDBM50035402
NameBDBM50035402
Synonyms:CHEMBL3343379
TypeSmall organic molecule
Emp. Form.C35H37FN6O4
Mol. Mass.624.7045
SMILESCOc1cc2c(Oc3ccc(NC(=O)c4nnn(c4C)-c4ccccc4C)cc3F)ccnc2cc1OCCCN1CCCCC1