Reaction Details
TargetVascular endothelial growth factor receptor 2
LigandBDBM50035354
Substrate/Competitorn/a
Meas. Tech.ChEMBL_1432752 (CHEMBL3381420)
IC50 65±n/a nM
Citation Zhou, SLiao, HLiu, MFeng, GFu, BLi, RCheng, MZhao, YGong, P Discovery andw biological evaluation of novel 6,7-disubstituted-4-(2-fluorophenoxy)quinoline derivatives possessing 1,2,3-triazole-4-carboxamide moiety as c-Met kinase inhibitors. Bioorg Med Chem22:6438-52 (2014) 
 
Vascular endothelial growth factor receptor 2
Name:Vascular endothelial growth factor receptor 2
Type:Receptor Tyrosine Kinase
Mol. Mass.:151510.97
Organism:Homo sapiens (Human)
Description:P35968
Residue:1356
BDBM50035354
NameBDBM50035354
Synonyms:CHEMBL3343366
TypeSmall organic molecule
Emp. Form.C33H29F5N6O4
Mol. Mass.668.6132
SMILESCOc1cc2c(Oc3ccc(NC(=O)c4nnn(c4C(F)(F)F)-c4ccc(F)cc4)cc3F)ccnc2cc1OCCCN1CCCC1