Reaction Details
TargetSerine/threonine-protein kinase PknB
LigandBDBM50035661
Substrate/Competitorn/a
Meas. Tech.ChEMBL_1434383 (CHEMBL3387070)
Ki 13130±n/a nM
Citation Naqvi, AMalasoni, RSrivastava, APandey, RRDwivedi, AK Design, synthesis and molecular docking of substituted 3-hydrazinyl-3-oxo-propanamides as anti-tubercular agents. Bioorg Med Chem Lett24:5181-4 (2014) 
 
Serine/threonine-protein kinase PknB
Name:Serine/threonine-protein kinase PknB
Type:PROTEIN
Mol. Mass.:66497.93
Organism:Mycobacterium tuberculosis
Description:ChEMBL_774233
Residue:626
BDBM50035661
NameBDBM50035661
Synonyms:CHEMBL3338465
TypeSmall organic molecule
Emp. Form.C13H20N4O2
Mol. Mass.264.3235
SMILESCCN(CC)c1ccc(NC(=O)CC(=O)NN)cc1