Reaction Details
TargetNuclear receptor ROR-gamma
LigandBDBM50035909
Substrate/Competitorn/a
Meas. Tech.ChEMBL_1442780 (CHEMBL3375302)
IC50 6.0±n/a nM
Citation van Niel, MBFauber, BPCartwright, MGaines, SKillen, JCRené, OWard, SIde Leon Boenig, GDeng, YEidenschenk, CEverett, CGancia, EGanguli, AGobbi, AHawkins, JJohnson, ARKiefer, JRLa, HLockey, PNorman, MOuyang, WQin, AWakes, NWaszkowycz, BWong, H A reversed sulfonamide series of selective RORc inverse agonists. Bioorg Med Chem Lett24:5769-76 (2014) 
 
Nuclear receptor ROR-gamma
Name:Nuclear receptor ROR-gamma
Type:Enzyme Catalytic Domain
Mol. Mass.:58218.40
Organism:Homo sapiens (Human)
Description:P51449
Residue:518
BDBM50035909
NameBDBM50035909
Synonyms:CHEMBL3361052
TypeSmall organic molecule
Emp. Form.C24H31F3N2O5S2
Mol. Mass.548.639
SMILESCC(C)CN(Cc1ccccc1C(F)(F)F)S(=O)(=O)c1ccc(OC2CCN(CC2)S(C)(=O)=O)cc1