Reaction Details
TargetHistone deacetylase 1
LigandBDBM50036285
Substrate/Competitorn/a
Meas. Tech.ChEMBL_1431995 (CHEMBL3388100)
IC50 15000±n/a nM
Citation Blackburn, CBarrett, CBrunson, MChin, JEngland, DGarcia, KGigstad, KGould, AGutierrez, JHoar, KRowland, RSTsu, CRingeling, JWager, KXu, H Histone deacetylase inhibitors derived from 1,2,3,4-tetrahydropyrrolo[1,2-a]pyrazine and related heterocycles selective for the HDAC6 isoform. Bioorg Med Chem Lett24:5450-4 (2015) 
 
Histone deacetylase 1
Name:Histone deacetylase 1
Type:Enzyme
Mol. Mass.:55090.27
Organism:Homo sapiens (Human)
Description:Q13547
Residue:482
BDBM50036285
NameBDBM50036285
Synonyms:CHEMBL3353053
TypeSmall organic molecule
Emp. Form.C14H16N4O3
Mol. Mass.288.3018
SMILESCn1cccc1C(=O)N1CCn2cc(cc2C1)C(=O)NO