Reaction Details
TargetHistone deacetylase 3
LigandBDBM50440907
Substrate/Competitorn/a
Meas. Tech.ChEMBL_1431997 (CHEMBL3388102)
IC50 46000±n/a nM
Citation Blackburn, CBarrett, CBrunson, MChin, JEngland, DGarcia, KGigstad, KGould, AGutierrez, JHoar, KRowland, RSTsu, CRingeling, JWager, KXu, H Histone deacetylase inhibitors derived from 1,2,3,4-tetrahydropyrrolo[1,2-a]pyrazine and related heterocycles selective for the HDAC6 isoform. Bioorg Med Chem Lett24:5450-4 (2015) 
 
Histone deacetylase 3
Name:Histone deacetylase 3
Type:Enzyme
Mol. Mass.:48829.55
Organism:Homo sapiens (Human)
Description:O15379
Residue:428
BDBM50440907
NameBDBM50440907
Synonyms:CHEMBL2431901
TypeSmall organic molecule
Emp. Form.C16H17N3O3
Mol. Mass.299.3245
SMILESCn1cccc1C(=O)N1CCc2cc(ccc2C1)C(=O)NO