Reaction Details
TargetHistone deacetylase 6
LigandBDBM50036299
Substrate/Competitorn/a
Meas. Tech.ChEMBL_1431993 (CHEMBL3388098)
IC50 730±n/a nM
Citation Blackburn, CBarrett, CBrunson, MChin, JEngland, DGarcia, KGigstad, KGould, AGutierrez, JHoar, KRowland, RSTsu, CRingeling, JWager, KXu, H Histone deacetylase inhibitors derived from 1,2,3,4-tetrahydropyrrolo[1,2-a]pyrazine and related heterocycles selective for the HDAC6 isoform. Bioorg Med Chem Lett24:5450-4 (2015) 
 
Histone deacetylase 6
Name:Histone deacetylase 6
Type:Chromatin regulator; hydrolase; repressor
Mol. Mass.:131381.51
Organism:Homo sapiens (Human)
Description:Q9UBN7
Residue:1215
BDBM50036299
NameBDBM50036299
Synonyms:CHEMBL3353058
TypeSmall organic molecule
Emp. Form.C15H21N3O3
Mol. Mass.291.3455
SMILESONC(=O)c1cc2CN(CCn2c1)C(=O)C1CCCCC1