Reaction Details
TargetL-lactate dehydrogenase A chain
LigandBDBM50040093
Substrate/Competitorn/a
Meas. Tech.ChEMBL_1443550 (CHEMBL3378383)
IC50 360±n/a nM
Citation Fauber, BPDragovich, PSChen, JCorson, LBDing, CZEigenbrot, CLabadie, SMalek, SPeterson, DPurkey, HERobarge, KSideris, SUltsch, MWei, BYen, IYue, QZhou, A Identification of 3,6-disubstituted dihydropyrones as inhibitors of human lactate dehydrogenase. Bioorg Med Chem Lett24:5683-7 (2014) 
 
L-lactate dehydrogenase A chain
Name:L-lactate dehydrogenase A chain
Type:Protein
Mol. Mass.:36694.85
Organism:Homo sapiens (Human)
Description:P00338::PDB Code: 4ajp
Residue:332
BDBM50040093
NameBDBM50040093
Synonyms:CHEMBL3359438
TypeSmall organic molecule
Emp. Form.C19H15ClO3S
Mol. Mass.358.839
SMILESOC1=C(Sc2ccccc2Cl)C(=O)OC2(CCc3ccccc23)C1