Reaction Details
TargetHepatocyte growth factor receptor
LigandBDBM50044325
Substrate/Competitorn/a
Meas. Tech.ChEMBL_1450832 (CHEMBL3364271)
IC50 6.9±n/a nM
Citation Song, ZYang, YLiu, ZPeng, XGuo, JYang, XWu, KAi, JDing, JGeng, MZhang, A Discovery of novel 2,4-diarylaminopyrimidine analogues (DAAPalogues) showing potent inhibitory activities against both wild-type and mutant ALK kinases. J Med Chem58:197-211 (2015) 
 
Hepatocyte growth factor receptor
Name:Hepatocyte growth factor receptor
Type:Protein
Mol. Mass.:155559.73
Organism:Homo sapiens (Human)
Description:P08581
Residue:1390
BDBM50044325
NameBDBM50044325
Synonyms:CHEMBL3357444
TypeSmall organic molecule
Emp. Form.C22H25ClN6O3S
Mol. Mass.488.99
SMILESC[C@H](N)C(=O)Nc1cccc(Nc2ncc(Cl)c(Nc3ccccc3S(=O)(=O)C(C)C)n2)c1