Reaction Details
TargetVascular endothelial growth factor receptor 2
LigandBDBM50044303
Substrate/Competitorn/a
Meas. Tech.ChEMBL_1451683 (CHEMBL3366514)
IC50>1000±n/a nM
Citation Song, ZYang, YLiu, ZPeng, XGuo, JYang, XWu, KAi, JDing, JGeng, MZhang, A Discovery of novel 2,4-diarylaminopyrimidine analogues (DAAPalogues) showing potent inhibitory activities against both wild-type and mutant ALK kinases. J Med Chem58:197-211 (2015) 
 
Vascular endothelial growth factor receptor 2
Name:Vascular endothelial growth factor receptor 2
Type:Receptor Tyrosine Kinase
Mol. Mass.:151510.97
Organism:Homo sapiens (Human)
Description:P35968
Residue:1356
BDBM50044303
NameBDBM50044303
Synonyms:CHEMBL3357439
TypeSmall organic molecule
Emp. Form.C21H23ClN6O3S
Mol. Mass.474.964
SMILESCC(C)S(=O)(=O)c1ccccc1Nc1nc(Nc2cccc(NC(=O)CN)c2)ncc1Cl