Reaction Details
TargetALK tyrosine kinase receptor
LigandBDBM50044468
Substrate/Competitorn/a
Meas. Tech.ChEMBL_1450833 (CHEMBL3364272)
IC50 2.3±n/a nM
Citation Song, ZYang, YLiu, ZPeng, XGuo, JYang, XWu, KAi, JDing, JGeng, MZhang, A Discovery of novel 2,4-diarylaminopyrimidine analogues (DAAPalogues) showing potent inhibitory activities against both wild-type and mutant ALK kinases. J Med Chem58:197-211 (2015) 
 
ALK tyrosine kinase receptor
Name:ALK tyrosine kinase receptor
Type:Protein
Mol. Mass.:176453.10
Organism:Homo sapiens (Human)
Description:Q9UM73
Residue:1620
BDBM50044468
NameBDBM50044468
Synonyms:CHEMBL3357463
TypeSmall organic molecule
Emp. Form.C27H32ClN7O3S
Mol. Mass.570.106
SMILESCC(C)S(=O)(=O)c1ccccc1Nc1nc(Nc2cccc(NC(=O)CN3CCC4CNCC34)c2)ncc1Cl