Reaction Details
TargetN-lysine methyltransferase KMT5A
LigandBDBM50051117
Substrate/Competitorn/a
Meas. Tech.ChEMBL_1450380 (CHEMBL3378784)
IC50 9000±n/a nM
Citation Ma, AYu, WLi, FBleich, RMHerold, JMButler, KVNorris, JLKorboukh, VTripathy, AJanzen, WPArrowsmith, CHFrye, SVVedadi, MBrown, PJJin, J Discovery of a selective, substrate-competitive inhibitor of the lysine methyltransferase SETD8. J Med Chem57:6822-33 (2014) 
 
N-lysine methyltransferase KMT5A
Name:N-lysine methyltransferase KMT5A
Type:Enzyme
Mol. Mass.:42919.11
Organism:Homo sapiens (Human)
Description:Q9NQR1
Residue:393
BDBM50051117
NameBDBM50051117
Synonyms:CHEMBL3318285
TypeSmall organic molecule
Emp. Form.C23H35N5O2
Mol. Mass.413.5563
SMILESCOc1cc2nc(nc(NCCCCCN3CCCC3)c2cc1OC)N1CCCC1