Reaction Details
TargetN-lysine methyltransferase KMT5A
LigandBDBM50051124
Substrate/Competitorn/a
Meas. Tech.ChEMBL_1450359 (CHEMBL3378196)
IC50 35000±n/a nM
Citation Ma, AYu, WLi, FBleich, RMHerold, JMButler, KVNorris, JLKorboukh, VTripathy, AJanzen, WPArrowsmith, CHFrye, SVVedadi, MBrown, PJJin, J Discovery of a selective, substrate-competitive inhibitor of the lysine methyltransferase SETD8. J Med Chem57:6822-33 (2014) 
 
N-lysine methyltransferase KMT5A
Name:N-lysine methyltransferase KMT5A
Type:Enzyme
Mol. Mass.:42919.11
Organism:Homo sapiens (Human)
Description:Q9NQR1
Residue:393
BDBM50051124
NameBDBM50051124
Synonyms:CHEMBL3318292
TypeSmall organic molecule
Emp. Form.C28H44N6O4
Mol. Mass.528.6868
SMILESCOc1cc2nc(nc(NCCCCCN3CCN(CC3)C(=O)OC(C)(C)C)c2cc1OC)N1CCCC1