Reaction Details
TargetN-lysine methyltransferase KMT5A
LigandBDBM50051398
Substrate/Competitorn/a
Meas. Tech.ChEMBL_1450359 (CHEMBL3378196)
IC50>250000±n/a nM
Citation Ma, AYu, WLi, FBleich, RMHerold, JMButler, KVNorris, JLKorboukh, VTripathy, AJanzen, WPArrowsmith, CHFrye, SVVedadi, MBrown, PJJin, J Discovery of a selective, substrate-competitive inhibitor of the lysine methyltransferase SETD8. J Med Chem57:6822-33 (2014) 
 
N-lysine methyltransferase KMT5A
Name:N-lysine methyltransferase KMT5A
Type:Enzyme
Mol. Mass.:42919.11
Organism:Homo sapiens (Human)
Description:Q9NQR1
Residue:393
BDBM50051398
NameBDBM50051398
Synonyms:CHEMBL3318308
TypeSmall organic molecule
Emp. Form.C19H27ClN4O2
Mol. Mass.378.896
SMILESCOc1cc2nc(Cl)nc(NCCCCCN3CCCC3)c2cc1OC