Reaction Details
TargetAcetylcholinesterase
LigandBDBM50052205
Substrate/Competitorn/a
Meas. Tech.ChEMBL_1455650 (CHEMBL3365679)
IC50 47±n/a nM
Citation Akrami, HMirjalili, BFKhoobi, MNadri, HMoradi, ASakhteman, AEmami, SForoumadi, AShafiee, A Indolinone-based acetylcholinesterase inhibitors: synthesis, biological activity and molecular modeling. Eur J Med Chem84:375-81 (2014) 
 
Acetylcholinesterase
Name:Acetylcholinesterase
Type:Enzyme
Mol. Mass.:71812.79
Organism:Electrophorus electricus (Electric eel)
Description:n/a
Residue:633
BDBM50052205
NameBDBM50052205
Synonyms:CHEMBL3318390
TypeSmall organic molecule
Emp. Form.C21H17BrN2O
Mol. Mass.393.276
SMILES[Br-].O=C1Nc2ccccc2\C1=C/c1cc[n+](Cc2ccccc2)cc1