Reaction Details
TargetAcetylcholinesterase
LigandBDBM50052203
Substrate/Competitorn/a
Meas. Tech.ChEMBL_1455650 (CHEMBL3365679)
IC50 258±n/a nM
Citation Akrami, HMirjalili, BFKhoobi, MNadri, HMoradi, ASakhteman, AEmami, SForoumadi, AShafiee, A Indolinone-based acetylcholinesterase inhibitors: synthesis, biological activity and molecular modeling. Eur J Med Chem84:375-81 (2014) 
 
Acetylcholinesterase
Name:Acetylcholinesterase
Type:Enzyme
Mol. Mass.:71812.79
Organism:Electrophorus electricus (Electric eel)
Description:n/a
Residue:633
BDBM50052203
NameBDBM50052203
Synonyms:CHEMBL3318409
TypeSmall organic molecule
Emp. Form.C21H15Cl3N2O
Mol. Mass.417.716
SMILES[Cl-].Clc1ccc(C[n+]2ccc(\C=C3\C(=O)Nc4ccccc34)cc2)c(Cl)c1