Reaction Details
TargetCholinesterase
LigandBDBM50052211
Substrate/Competitorn/a
Meas. Tech.ChEMBL_1455651 (CHEMBL3365680)
IC50 1500±n/a nM
Citation Akrami, HMirjalili, BFKhoobi, MNadri, HMoradi, ASakhteman, AEmami, SForoumadi, AShafiee, A Indolinone-based acetylcholinesterase inhibitors: synthesis, biological activity and molecular modeling. Eur J Med Chem84:375-81 (2014) 
 
Cholinesterase
Name:Cholinesterase
Type:Enzyme
Mol. Mass.:65643.35
Organism:Equus caballus (Horse)
Description:P81908
Residue:574
BDBM50052211
NameBDBM50052211
Synonyms:CHEMBL3318399
TypeSmall organic molecule
Emp. Form.C21H15Cl3N2O
Mol. Mass.417.716
SMILES[Cl-].Clc1cccc(Cl)c1C[n+]1ccc(\C=C2\C(=O)Nc3ccccc23)cc1