Reaction Details
TargetHistone deacetylase 2
LigandBDBM50055512
Substrate/Competitorn/a
Meas. Tech.ChEMBL_1452234 (CHEMBL3366146)
IC50 1.4±n/a nM
Citation Kim, BPark, HSalvador, LASerrano, PEKwan, JCZeller, SLChen, QYRyu, SLiu, YByeon, SLuesch, HHong, J Evaluation of class I HDAC isoform selectivity of largazole analogues. Bioorg Med Chem Lett24:3728-31 (2014) 
 
Histone deacetylase 2
Name:Histone deacetylase 2
Type:Chromatin regulator; hydrolase; repressor
Mol. Mass.:55356.54
Organism:Homo sapiens (Human)
Description:Q92769
Residue:488
BDBM50055512
NameBDBM50055512
Synonyms:CHEMBL3317812
TypeSmall organic molecule
Emp. Form.C22H26N6O4S3
Mol. Mass.534.675
SMILESC[C@@]12CSC(=N1)c1csc(CNC(=O)C[C@H](OC(=O)[C@H](Cc3c[nH]cn3)NC2=O)\C=C\CCS)n1