Reaction Details
TargetHistone deacetylase 2
LigandBDBM50020912
Substrate/Competitorn/a
Meas. Tech.ChEMBL_1452234 (CHEMBL3366146)
IC50 0.900000±n/a nM
Citation Kim, BPark, HSalvador, LASerrano, PEKwan, JCZeller, SLChen, QYRyu, SLiu, YByeon, SLuesch, HHong, J Evaluation of class I HDAC isoform selectivity of largazole analogues. Bioorg Med Chem Lett24:3728-31 (2014) 
 
Histone deacetylase 2
Name:Histone deacetylase 2
Type:Chromatin regulator; hydrolase; repressor
Mol. Mass.:55356.54
Organism:Homo sapiens (Human)
Description:Q92769
Residue:488
BDBM50020912
NameBDBM50020912
Synonyms:Largazole Thiol
TypeSmall organic molecule
Emp. Form.C21H28N4O4S3
Mol. Mass.496.666
SMILES[H][C@]1(CC(=O)NCc2nc(cs2)C2=N[C@@](C)(CS2)C(=O)N[C@H](C(C)C)C(=O)O1)\C=C\CCS