Reaction Details
TargetPeptidyl-prolyl cis-trans isomerase NIMA-interacting 1
LigandBDBM50056207
Substrate/Competitorn/a
Meas. Tech.ChEMBL_1449741 (CHEMBL3378164)
Ki 424±n/a nM
Citation Guo, CHou, XDong, LMarakovits, JGreasley, SDagostino, EFerre, RJohnson, MCHumphries, PSLi, HPaderes, GDPiraino, JKraynov, EMurray, BW Structure-based design of novel human Pin1 inhibitors (III): optimizing affinity beyond the phosphate recognition pocket. Bioorg Med Chem Lett24:4187-91 (2014) 
 
Peptidyl-prolyl cis-trans isomerase NIMA-interacting 1
Name:Peptidyl-prolyl cis-trans isomerase NIMA-interacting 1
Type:PROTEIN
Mol. Mass.:18248.11
Organism:Homo sapiens (Human)
Description:ChEMBL_1502595
Residue:163
BDBM50056207
NameBDBM50056207
Synonyms:CHEMBL3322218
TypeSmall organic molecule
Emp. Form.C20H17N3O3S
Mol. Mass.379.432
SMILESCc1ccc2[nH]c(C[C@@H](NC(=O)c3cc4ccccc4s3)C(O)=O)nc2c1