Reaction Details
TargetSodium channel protein type 9 subunit alpha
LigandBDBM50057401
Substrate/Competitorn/a
Meas. Tech.ChEMBL_1460307 (CHEMBL3370462)
IC50 37±n/a nM
Citation Ho, GDTulshian, DBercovici, ATan, ZHanisak, JBrumfield, SMatasi, JHeap, CREarley, WGCourneya, BHerr, RJZhou, XBridal, TRindgen, DSorota, SYang, SW Discovery of pyrrolo-benzo-1,4-diazines as potent Na(v)1.7 sodium channel blockers. Bioorg Med Chem Lett24:4110-3 (2014) 
 
Sodium channel protein type 9 subunit alpha
Name:Sodium channel protein type 9 subunit alpha
Type:Protein
Mol. Mass.:226375.97
Organism:Homo sapiens (Human)
Description:Q15858
Residue:1988
BDBM50057401
NameBDBM50057401
Synonyms:CHEMBL3322776
TypeSmall organic molecule
Emp. Form.C24H24ClN3O3
Mol. Mass.437.919
SMILESCOc1ccc-2c(NC3(CCN(CC3)C(=O)c3ccc(OC)c(Cl)c3)c3cccn-23)c1