Reaction Details
TargetCoagulation factor X
LigandBDBM50063582
Substrate/Competitorn/a
Meas. Tech.ChEMBL_1463560 (CHEMBL3398778)
Ki 1500±n/a nM
Citation Pinto, DJSmallheer, JMCorte, JRAustin, EJWang, CFang, TSmith, LMRossi, KARendina, ARBozarth, JMZhang, GWei, ARamamurthy, VSheriff, SMyers, JEMorin, PELuettgen, JMSeiffert, DAQuan, MLWexler, RR Structure-based design of inhibitors of coagulation factor XIa with novel P1 moieties. Bioorg Med Chem Lett25:1635-42 (2015) 
 
Coagulation factor X
Name:Coagulation factor X
Type:Enzyme
Mol. Mass.:54726.60
Organism:Homo sapiens (Human)
Description:n/a
Residue:488
BDBM50063582
NameBDBM50063582
Synonyms:CHEMBL3398642
TypeSmall organic molecule
Emp. Form.C29H25ClN8O3
Mol. Mass.569.014
SMILESCOC(=O)Nc1ccc(cc1)-c1c[nH]c(n1)[C@H](Cc1ccccc1)NC(=O)\C=C\c1cc(Cl)ccc1-n1cnnn1