Reaction Details
TargetProthrombin
LigandBDBM50063581
Substrate/Competitorn/a
Meas. Tech.ChEMBL_1463561 (CHEMBL3398779)
Ki>12610±n/a nM
Citation Pinto, DJSmallheer, JMCorte, JRAustin, EJWang, CFang, TSmith, LMRossi, KARendina, ARBozarth, JMZhang, GWei, ARamamurthy, VSheriff, SMyers, JEMorin, PELuettgen, JMSeiffert, DAQuan, MLWexler, RR Structure-based design of inhibitors of coagulation factor XIa with novel P1 moieties. Bioorg Med Chem Lett25:1635-42 (2015) 
 
Prothrombin
Name:Prothrombin
Type:Protein
Mol. Mass.:70029.57
Organism:Homo sapiens (Human)
Description:P00734
Residue:622
BDBM50063581
NameBDBM50063581
Synonyms:CHEMBL3398612
TypeSmall organic molecule
Emp. Form.C26H30ClN7O
Mol. Mass.492.016
SMILESNC[C@H]1CC[C@@H](CC1)C(=O)N[C@@H](Cc1ccccc1)c1nc(c(Cl)[nH]1)-c1ccc2c(N)n[nH]c2c1