Reaction Details
TargetCoagulation factor XI
LigandBDBM50063587
Substrate/Competitorn/a
Meas. Tech.ChEMBL_1463486 (CHEMBL3399896)
Ki 1.0±n/a nM
Citation Pinto, DJSmallheer, JMCorte, JRAustin, EJWang, CFang, TSmith, LMRossi, KARendina, ARBozarth, JMZhang, GWei, ARamamurthy, VSheriff, SMyers, JEMorin, PELuettgen, JMSeiffert, DAQuan, MLWexler, RR Structure-based design of inhibitors of coagulation factor XIa with novel P1 moieties. Bioorg Med Chem Lett25:1635-42 (2015) 
 
Coagulation factor XI
Name:Coagulation factor XI
Type:Enzyme
Mol. Mass.:70130.58
Organism:Homo sapiens (Human)
Description:P03951
Residue:625
BDBM50063587
NameBDBM50063587
Synonyms:CHEMBL3398615
TypeSmall organic molecule
Emp. Form.C26H23ClFN7O
Mol. Mass.503.959
SMILESNCc1ccc(C(=O)N[C@@H](Cc2ccccc2)c2nc(c(Cl)[nH]2)-c2ccc3c(N)n[nH]c3c2)c(F)c1