Reaction Details
TargetTyrosine-protein kinase BTK
LigandBDBM50063962
Substrate/Competitorn/a
Meas. Tech.ChEMBL_1464166 (CHEMBL3407032)
IC50 7.0±n/a nM
Citation Zhao, XHuang, WWang, YXin, MJin, QCai, JTang, FZhao, YXiang, H Discovery of novel Bruton's tyrosine kinase (BTK) inhibitors bearing a pyrrolo[2,3-d]pyrimidine scaffold. Bioorg Med Chem23:891-901 (2015) 
 
Tyrosine-protein kinase BTK
Name:Tyrosine-protein kinase BTK
Type:Enzyme
Mol. Mass.:76289.95
Organism:Homo sapiens (Human)
Description:Q06187
Residue:659
BDBM50063962
NameBDBM50063962
Synonyms:CHEMBL3402584
TypeSmall organic molecule
Emp. Form.C33H31FN6O3
Mol. Mass.578.636
SMILESCN(C)C(=O)N1CCC(=CC1)c1cc2c(ncnc2[nH]1)-c1cccc(c1CO)-n1ccc2cc(cc(F)c2c1=O)C1CC1