Reaction Details
TargetTyrosine-protein kinase BTK
LigandBDBM50063963
Substrate/Competitorn/a
Meas. Tech.ChEMBL_1464166 (CHEMBL3407032)
IC50 4.8±n/a nM
Citation Zhao, XHuang, WWang, YXin, MJin, QCai, JTang, FZhao, YXiang, H Discovery of novel Bruton's tyrosine kinase (BTK) inhibitors bearing a pyrrolo[2,3-d]pyrimidine scaffold. Bioorg Med Chem23:891-901 (2015) 
 
Tyrosine-protein kinase BTK
Name:Tyrosine-protein kinase BTK
Type:Enzyme
Mol. Mass.:76289.95
Organism:Homo sapiens (Human)
Description:Q06187
Residue:659
BDBM50063963
NameBDBM50063963
Synonyms:CHEMBL3402585
TypeSmall organic molecule
Emp. Form.C35H33FN6O4
Mol. Mass.620.6727
SMILESOCc1c(cccc1-n1ccc2cc(cc(F)c2c1=O)C1CC1)-c1ncnc2[nH]c(cc12)C1=CCN(CC1)C(=O)N1CCOCC1