Reaction Details
TargetC-X-C chemokine receptor type 2
LigandBDBM50065249
Substrate/Competitorn/a
Meas. Tech.ChEMBL_1465563 (CHEMBL3404716)
IC50 7943±n/a nM
Citation Austin, RPBennion, CBonnert, RVCheema, LCook, ARCox, RJEbden, MRGaw, AGrime, KMeghani, PNicholls, DPhillips, CSmith, NSteele, JStonehouse, JP Discovery and evaluation of a novel monocyclic series of CXCR2 antagonists. Bioorg Med Chem Lett25:1616-20 (2015) 
 
C-X-C chemokine receptor type 2
Name:C-X-C chemokine receptor type 2
Type:Protein
Mol. Mass.:40767.88
Organism:Homo sapiens (Human)
Description:P25025
Residue:360
BDBM50065249
NameBDBM50065249
Synonyms:CHEMBL3403831
TypeSmall organic molecule
Emp. Form.C15H20N4O3S2
Mol. Mass.368.474
SMILESC[C@H](O)CNc1cc(NS(C)(=O)=O)nc(SCc2ccccc2)n1