Reaction Details
TargetC-X-C chemokine receptor type 2
LigandBDBM50065327
Substrate/Competitorn/a
Meas. Tech.ChEMBL_1465563 (CHEMBL3404716)
IC50 2.5±n/a nM
Citation Austin, RPBennion, CBonnert, RVCheema, LCook, ARCox, RJEbden, MRGaw, AGrime, KMeghani, PNicholls, DPhillips, CSmith, NSteele, JStonehouse, JP Discovery and evaluation of a novel monocyclic series of CXCR2 antagonists. Bioorg Med Chem Lett25:1616-20 (2015) 
 
C-X-C chemokine receptor type 2
Name:C-X-C chemokine receptor type 2
Type:Protein
Mol. Mass.:40767.88
Organism:Homo sapiens (Human)
Description:P25025
Residue:360
BDBM50065327
NameBDBM50065327
Synonyms:CHEMBL3403851
TypeSmall organic molecule
Emp. Form.C17H21ClFN5O3S2
Mol. Mass.461.962
SMILESC[C@H](CO)Nc1cc(NS(=O)(=O)N2CCC2)nc(SCc2cccc(Cl)c2F)n1